{"text_format":"1","workbook":"xlsx","n_sheets":6,"sheets":["Deutsch","Français","Mehrsprachig Deutsch","Mehrsprachig Franz","Tabelle1","Anleitung"],"not_rendered":{"charts":0,"images":3,"macros":1,"external_links":0,"defined_names":7,"comments":0,"pivot_tables":0},"unopened":[],"bounds":{"document_bytes":16777216,"sheet_cells":100000,"rows_first":2000,"rows_last":500,"rows_between":2000,"halvings":0,"cell_chars":16384,"cell_head_chars":4096},"cells_cut":0,"cells_raw":0,"read":"whole","date_system":"1900"}

{"sheet":"Deutsch","index":0,"n_rows":85,"n_cols":19,"rows_kept":85,"cut":false,"hidden":false,"merged":[[6,7,9,7],[6,8,9,8],[27,5,27,6],[4,3,4,6],[4,1,4,2],[2,1,2,2],[3,1,3,2],[3,3,3,6],[2,4,2,6],[2,7,5,8]]}
[null,null,null,null,null,null,null,null,"2019.ERZ.96 / 681538"]
[]
[null,"SOE-Key: ",null,null,null,null,null,"Referenzwerte ePM"]
[null,"Schule:",null,{"$f":"IF(D3=\"\",\"\",IF(ISERROR(VLOOKUP(D3,Tabelle1!$B$10:$F$461,2,FALSE)),\"SOE-Key ungültig\",VLOOKUP(D3,Tabelle1!$B$10:$F$461,2,FALSE)))","v":""}]
["\n","Trägergemeinde:",null,{"$f":"IF(ISERROR(VLOOKUP(D3,Tabelle1!$B$10:$F$461,3,FALSE)),\"\",VLOOKUP(D3,Tabelle1!$B$10:$F$461,3,FALSE))","v":""}]
[]
[null,null,null,null,null,null,null,"gültig per 1.8.2021\nSJ 2021/22","gültig ab 1.8.2022\nSJ 2022/23"]
["Berechnung der Pools für die Volksschule, LAV, Anhang 4"]
["Wird mit der Freigabe der ePM 1. Semester unterschrieben an das Regionale Schulinspektorat eingereicht."]
[]
[]
["Schulleitungspool"]
["LAV, Anhang 4 Kap. 1:   a * 0.062 + b * 0.106 + c * 0.194 = SL-Pool-%"]
[]
["Korrekturfaktor für Lektionen in Abhängigkeit der Schulwochen (=SW): ",null,null,null,"b * SW / 39"]
[]
["Anzahl Auszubildende (a)"]
[]
["Anzahl Lektionen (b) gem. Pensenmeldung pro Schule mit 1)",null,null,38,"SW pro Jahr"]
[null,null,null,39,"SW pro Jahr"]
[]
["Anzahl Lektionen (b); SW-Korrekturfaktor berücksichtigt",null,null,null,null,null,{"$f":"G19*D19/39 + G20*D20/39","v":0}]
[]
["Anzahl Lehrkräfte (c) gem. Pensenmeldung pro Schule "]
["(exkl. Lehrkräfte für Spezialunterricht* und exkl. 1 Person mit Schulleitungsfunktion) "]
[]
["Bei zweisprachigen Schulen (+  a *  0.03 ) mit x markieren ",null,null,null,null,null,null,null,null,null,"Diff.f.B-br.","Fall1","Fall2","Fall3","Fall4","Fall5","Fall6","Fall7","Fall8"]
[null,null,null,null,null,{"$f":"ROUND(0.062 *G17 + 0.106 * G22 + 0.194 * G24,3)","v":0}]
["Gesamttotal Beschäftigungsgrad Schulleitungspool (ab 2.5% gerundet)",null,null,null,null,null,{"$f":"IF(SUM(G17,G19:G20,G22:G24)=0,\"\",IF((G27<>\"x\"),F28,F28 + G17 * 0.03))","v":""},{"$f":"IF(ISERROR(VLOOKUP(D3,Tabelle1!$B$10:$F$461,4,FALSE)),\"\",VLOOKUP(D3,Tabelle1!$B$10:$F$461,4,FALSE))","v":""},{"$f":"IF(L29<>\"\",L29,IF(M29<>\"\",M29,IF(N29<>\"\",N29,IF(O29<>\"\",O29,IF(P29<>\"\",P29,IF(Q29<>\"\",Q29,IF(R29<>\"\",R29,IF(S29<>\"\",S29,\"\"))))))))","v":""},null,{"$f":"IF(G29=\"\",0,ABS(H29-G29))","v":0},{"$f":"IF($G$29=\"\",\"\",IF(AND($G$29>=2.5,$H$29<=60,$H$29>=5,$K$29>3),ROUND($G$29/500,2)*500,\"\"))","v":""},{"$f":"IF($G$29=\"\",\"\",IF(AND($G$29>=2.5,$H$29<=60,$H$29>=5,$K$29<=3),$H$29,\"\"))","v":""},{"$f":"IF($G$29=\"\",\"\",IF(AND($G$29>=2.5,$H$29>60,$K$29>6),ROUND($G$29/500,2)*500,\"\"))","v":""},{"$f":"IF($G$29=\"\",\"\",IF(AND($G$29>=2.5,$H$29>60,$K$29<=6),$H$29,\"\"))","v":""},{"$f":"IF($G$29=\"\",\"\",IF(AND($G$29<2.5,$K$29>3),$G$29,\"\"))","v":""},{"$f":"IF($G$29=\"\",\"\",IF(AND($G$29<2.5,$H$29>=2.5,$K$29<=3),$H$29,\"\"))","v":""},{"$f":"IF($G$29=\"\",\"\",IF(AND($G$29<2.5,$H$29<2.5),$G$29,\"\"))","v":""},{"$f":"IF($G$29=\"\",\"\",IF(AND($G$29>=2.5,$H$29<=2.5),ROUND($G$29/500,2)*500,\"\"))","v":""}]
[]
["Gesamttotal Beschäftigungsgrad Schulleitungspool (ab 2.5% gerundet)",null,null,null,null,null,{"$f":"IFERROR(IF(G29<2.5,G29,ROUND(G29/500,2)*500),\"\")","v":""}]
[]
[]
["Pool für Spezialaufgaben (60% vom gerundeten Schulleitungspool, LAV, Anhang 4, Ziff. 3.3)"]
[]
["LAV, Anhang 4, Ziff. 3.2: Vergrösserung (Andere Unterrichtsspr. oder Klassenaustausch)"]
["bis 9 beteiligte Klassen (+3.5%), mit x markieren"]
["ab 10 beteiligte Klassen (+7%), mit x markieren",null,{"$f":"IF(AND(G37=\"x\",G38=\"x\"),\"Nur 1 Feld markieren!\",\"\")","v":""}]
[null,null,null,null,null,null,{"$f":"IF(ISTEXT(I29),\"\",I29*0.6)","v":""}]
[null,null,null,null,null,null,{"$f":"IF(G37=\"x\",(G39+3.5),IF(G38=\"x\",(G39+7),G39))","v":""}]
{"$rows_left_out":46}
{"sheet":"Français","index":1,"n_rows":85,"n_cols":19,"rows_kept":85,"cut":false,"hidden":false,"merged":[[6,7,9,7],[6,8,9,8],[27,5,27,6],[2,1,2,2],[2,4,2,6],[2,7,5,8],[3,1,3,2],[3,3,3,6],[4,1,4,2],[4,3,4,6]]}
[null,null,null,null,null,null,null,null,"2019.ERZ.96 / 681538"]
[]
[null,"US-Key:",null,null,null,null,null,"Valeurs de référence CdPe"]
[null,"Etablissement:",null,{"$f":"IF(D3=\"\",\"\",IF(ISERROR(VLOOKUP(D3,Tabelle1!$B$10:$F$461,2,FALSE)),\"US-Key invalide\",VLOOKUP(D3,Tabelle1!$B$10:$F$461,2,FALSE)))","v":""}]
["\n","Commune:",null,{"$f":"IF(ISERROR(VLOOKUP(D3,Tabelle1!$B$10:$F$461,3,FALSE)),\"\",VLOOKUP(D3,Tabelle1!$B$10:$F$461,3,FALSE))","v":""}]
[]
[null,null,null,null,null,null,null,"valable à partir du 1.8.2021\nAs 2021/22","valable à partir du 1.8.2022\nAs 2022/23"]
["Calcul des pools de l'école obligatoire, OSE, annexe 4"]
["Ce formulaire doit être signé et remis à l'Inspection scolaire régional avec la validation de la CdPe du 1er semestre."]
[]
[]
["Pool de direction "]
["OSE, annexe 4 chap. 1:  a * 0.062 + b * 0.106 + c * 0.194 = Pool de direction %"]
[]
["Facteur de correction pour les leçons en fonction des semaines d'école (=SE): ",null,null,null,null,"b * SE / 39"]
[]
["Nombre d'élèves (a)"]
[]
["Nombre de leçons (b) selon la comm. des progr. par établissement 1)",null,null,null,38,"SE par an"]
[null,null,null,null,39,"SE par an"]
[]
["Nombre de leçons (b) avec le facteur de correction SE",null,null,null,null,null,{"$f":"G19*E19/39 + G20*E20/39","v":0}]
[]
["Nombre d'enseignants (c) selon comm. des progr. par établissement (ens. de l'enseign."]
["spécialisé et une personne exerçant une fonction de direction d'école exclus) "]
[]
["Ecoles bilingues, (+  a *  0.03 ) marquer avec x",null,null,null,null,null,null,null,null,null,"Diff.f.B-br.","Fall1","Fall2","Fall3","Fall4","Fall5","Fall6","Fall7","Fall8"]
[null,null,null,null,null,{"$f":"ROUND(0.062 *G17 + 0.106 * G22 + 0.194 * G24,3)","v":0}]
["Degré d'occupation total pour le pool de direction (dès 2.5% arrondi)",null,null,null,null,null,{"$f":"IF(SUM(G17,G19:G20,G22:G24)=0,\"\",IF((G27<>\"x\"),F28,F28 + G17 * 0.03))","v":""},{"$f":"IF(ISERROR(VLOOKUP(D3,Tabelle1!$B$10:$F$461,4,FALSE)),\"\",VLOOKUP(D3,Tabelle1!$B$10:$F$461,4,FALSE))","v":""},{"$f":"IF(L29<>\"\",L29,IF(M29<>\"\",M29,IF(N29<>\"\",N29,IF(O29<>\"\",O29,IF(P29<>\"\",P29,IF(Q29<>\"\",Q29,IF(R29<>\"\",R29,IF(S29<>\"\",S29,\"\"))))))))","v":""},null,{"$f":"IF(G29=\"\",0,ABS(H29-G29))","v":0},{"$f":"IF($G$29=\"\",\"\",IF(AND($G$29>=2.5,$H$29<=60,$H$29>=5,$K$29>3),ROUND($G$29/500,2)*500,\"\"))","v":""},{"$f":"IF($G$29=\"\",\"\",IF(AND($G$29>=2.5,$H$29<=60,$H$29>=5,$K$29<=3),$H$29,\"\"))","v":""},{"$f":"IF($G$29=\"\",\"\",IF(AND($G$29>=2.5,$H$29>60,$K$29>6),ROUND($G$29/500,2)*500,\"\"))","v":""},{"$f":"IF($G$29=\"\",\"\",IF(AND($G$29>=2.5,$H$29>60,$K$29<=6),$H$29,\"\"))","v":""},{"$f":"IF($G$29=\"\",\"\",IF(AND($G$29<2.5,$K$29>3),$G$29,\"\"))","v":""},{"$f":"IF($G$29=\"\",\"\",IF(AND($G$29<2.5,$H$29>=2.5,$K$29<=3),$H$29,\"\"))","v":""},{"$f":"IF($G$29=\"\",\"\",IF(AND($G$29<2.5,$H$29<2.5),$G$29,\"\"))","v":""},{"$f":"IF($G$29=\"\",\"\",IF(AND($G$29>=2.5,$H$29<=2.5),ROUND($G$29/500,2)*500,\"\"))","v":""}]
[]
["Gesamttotal Beschäftigungsgrad Schulleitungspool (ab 2.5% gerundet)",null,null,null,null,null,{"$f":"IFERROR(IF(G29<2.5,G29,ROUND(G29/500,2)*500),\"\")","v":""}]
[]
[]
["Pool destiné aux tâches spéciales (60% du pool de dir. arrondi, OSE, annexe 4, chiffre 3.3)"]
[]
["OSE, annexe 4, chiffre 3.2: Augmentation (autre langue d'enseign. ou échange de classes)"]
["Jusqu'à 9 classes impliquées (+3.5%), marquer avec x"]
["Dès 10 classes impliquées (+7%), marquer avec x",null,{"$f":"IF(AND(G37=\"x\",G38=\"x\"),\"Seulement marquer une croix!\",\"\")","v":""}]
[null,null,null,null,null,null,{"$f":"IF(ISTEXT(I29),\"\",I29*0.6)","v":""}]
[null,null,null,null,null,null,{"$f":"IF(G37=\"x\",(G39+3.5),IF(G38=\"x\",(G39+7),G39))","v":""}]
{"$rows_left_out":46}
{"sheet":"Mehrsprachig Deutsch","index":2,"n_rows":84,"n_cols":19,"rows_kept":84,"cut":false,"hidden":true,"merged":[[6,7,9,7],[6,8,9,8],[27,5,27,6],[2,1,2,2],[2,4,2,6],[2,7,5,8],[3,1,3,2],[3,3,3,6],[4,1,4,2],[4,3,4,6]]}
[null,null,null,null,null,null,null,null,"2019.ERZ.96 / 681538"]
[]
[null,"SOE-Key: ",null,null,null,null,null,"Referenzwerte ePM"]
[null,"Schule:",null,{"$f":"IF(D3=\"\",\"\",IF(ISERROR(VLOOKUP(D3,Tabelle1!$B$10:$F$461,2,FALSE)),\"SOE-Key ungültig\",VLOOKUP(D3,Tabelle1!$B$10:$F$461,2,FALSE)))","v":""}]
["\n","Trägergemeinde:",null,{"$f":"IF(ISERROR(VLOOKUP(D3,Tabelle1!$B$10:$F$461,3,FALSE)),\"\",VLOOKUP(D3,Tabelle1!$B$10:$F$461,3,FALSE))","v":""}]
[]
[null,null,null,null,null,null,null,"gültig per 1.8.2021\nSJ 2021/22","gültig ab 1.8.2022\nSJ 2022/23"]
["Berechnung der Pools für die Volksschule, LAV, Anhang 4"]
["Wird mit der Freigabe der ePM 1. Semester unterschrieben an das Regionale Schulinspektorat eingereicht."]
[]
[]
["Schulleitungspool"]
["LAV, Anhang 4 Kap. 1:   a * 0.062 + b * 0.106 + c * 0.194 = SL-Pool-%"]
[]
["Korrekturfaktor für Lektionen in Abhängigkeit der Schulwochen (=SW): ",null,null,null,"b * SW / 39"]
[]
["Anzahl Auszubildende (a)"]
[]
["Anzahl Lektionen (b) gem. Pensenmeldung pro Schule mit 1)",null,null,38,"SW pro Jahr"]
[null,null,null,39,"SW pro Jahr"]
[]
["Anzahl Lektionen (b); SW-Korrekturfaktor berücksichtigt",null,null,null,null,null,{"$f":"G19*D19/39 + G20*D20/39","v":0}]
[]
["Anzahl Lehrkräfte (c) gem. Pensenmeldung pro Schule "]
["(exkl. Lehrkräfte für Spezialunterricht* und exkl. 1 Person mit Schulleitungsfunktion) "]
[]
["Bei zweisprachigen Schulen (+  a *  0.03 ) mit x markieren ",null,null,null,null,null,null,null,null,null,"Diff.f.B-br.","Fall1","Fall2","Fall3","Fall4","Fall5","Fall6","Fall7","Fall8"]
[null,null,null,null,null,{"$f":"ROUND(0.062 *G17 + 0.106 * G22 + 0.194 * G24,3)","v":0}]
["Gesamttotal Beschäftigungsgrad Schulleitungspool (ab 2.5% gerundet)",null,null,null,null,null,{"$f":"IF(SUM(G17,G19:G20,G22:G24)=0,\"\",IF((G27<>\"x\"),F28,F28 + G17 * 0.03))","v":""},{"$f":"IF(ISERROR(VLOOKUP(D3,Tabelle1!$B$10:$F$461,4,FALSE)),\"\",VLOOKUP(D3,Tabelle1!$B$10:$F$461,4,FALSE))","v":""},{"$f":"IF(L29<>\"\",L29,IF(M29<>\"\",M29,IF(N29<>\"\",N29,IF(O29<>\"\",O29,IF(P29<>\"\",P29,IF(Q29<>\"\",Q29,IF(R29<>\"\",R29,IF(S29<>\"\",S29,\"\"))))))))","v":""},null,{"$f":"IF(G29=\"\",0,ABS(H29-G29))","v":0},{"$f":"IF($G$29=\"\",\"\",IF(AND($G$29>=2.5,$H$29<=60,$H$29>=5,$K$29>3),ROUND($G$29/500,2)*500,\"\"))","v":""},{"$f":"IF($G$29=\"\",\"\",IF(AND($G$29>=2.5,$H$29<=60,$H$29>=5,$K$29<=3),$H$29,\"\"))","v":""},{"$f":"IF($G$29=\"\",\"\",IF(AND($G$29>=2.5,$H$29>60,$K$29>6),ROUND($G$29/500,2)*500,\"\"))","v":""},{"$f":"IF($G$29=\"\",\"\",IF(AND($G$29>=2.5,$H$29>60,$K$29<=6),$H$29,\"\"))","v":""},{"$f":"IF($G$29=\"\",\"\",IF(AND($G$29<2.5,$K$29>3),$G$29,\"\"))","v":""},{"$f":"IF($G$29=\"\",\"\",IF(AND($G$29<2.5,$H$29>=2.5,$K$29<=3),$H$29,\"\"))","v":""},{"$f":"IF($G$29=\"\",\"\",IF(AND($G$29<2.5,$H$29<2.5),$G$29,\"\"))","v":""},{"$f":"IF($G$29=\"\",\"\",IF(AND($G$29>=2.5,$H$29<=2.5),ROUND($G$29/500,2)*500,\"\"))","v":""}]
[]
["Gesamttotal Beschäftigungsgrad Schulleitungspool (ab 2.5% gerundet)",null,null,null,null,null,{"$f":"IFERROR(IF(G29<2.5,G29,ROUND(G29/500,2)*500),\"\")","v":""}]
[]
[]
["Pool für Spezialaufgaben (60% vom gerundeten Schulleitungspool, LAV, Anhang 4, Ziff. 3.3)"]
[]
["LAV, Anhang 4, Ziff. 3.2: Vergrösserung (Andere Unterrichtsspr. oder Klassenaustausch)"]
["bis 9 beteiligte Klassen (+3.5%), mit x markieren"]
["ab 10 beteiligte Klassen (+7%), mit x markieren",null,{"$f":"IF(AND(G37=\"x\",G38=\"x\"),\"Nur 1 Feld markieren!\",\"\")","v":""}]
[null,null,null,null,null,null,{"$f":"IF(ISTEXT(I29),\"\",I29*0.6)","v":""}]
[null,null,null,null,null,null,{"$f":"IF(G37=\"x\",(G39+3.5),IF(G38=\"x\",(G39+7),G39))","v":""}]
{"$rows_left_out":45}
{"sheet":"Mehrsprachig Franz","index":3,"n_rows":85,"n_cols":19,"rows_kept":85,"cut":false,"hidden":true,"merged":[[6,7,9,7],[6,8,9,8],[27,5,27,6],[2,1,2,2],[2,4,2,6],[2,7,5,8],[3,1,3,2],[3,3,3,6],[4,1,4,2],[4,3,4,6]]}
[null,null,null,null,null,null,null,null,"2019.ERZ.96 / 681538"]
[]
[null,"US-Key:",null,null,null,null,null,"Valeurs de référence CdPe"]
[null,"Etablissement:",null,{"$f":"IF(D3=\"\",\"\",IF(ISERROR(VLOOKUP(D3,Tabelle1!$B$10:$F$461,2,FALSE)),\"US-Key invalide\",VLOOKUP(D3,Tabelle1!$B$10:$F$461,2,FALSE)))","v":""}]
["\n","Commune:",null,{"$f":"IF(ISERROR(VLOOKUP(D3,Tabelle1!$B$10:$F$461,3,FALSE)),\"\",VLOOKUP(D3,Tabelle1!$B$10:$F$461,3,FALSE))","v":""}]
[]
[null,null,null,null,null,null,null,"valable à partir du 1.8.2021\nAs 2021/22","valable à partir du 1.8.2022\nAs 2022/23"]
["Calcul des pools de l'école obligatoire, OSE, annexe 4"]
["Ce formulaire doit être signé et remis à l'Inspection scolaire régional avec la validation de la CdPe du 1er semestre."]
[]
[]
["Pool de direction "]
["OSE, annexe 4 chap. 1:  a * 0.062 + b * 0.106 + c * 0.194 = Pool de direction %"]
[]
["Facteur de correction pour les leçons en fonction des semaines d'école (=SE): ",null,null,null,null,"b * SE / 39"]
[]
["Nombre d'élèves (a)"]
[]
["Nombre de leçons (b) selon la comm. des progr. par établissement 1)",null,null,null,38,"SE par an"]
[null,null,null,null,39,"SE par an"]
[]
["Nombre de leçons (b) avec le facteur de correction SE",null,null,null,null,null,{"$f":"G19*E19/39 + G20*E20/39","v":0}]
[]
["Nombre d'enseignants (c) selon comm. des progr. par établissement (ens. de l'enseign."]
["spécialisé et une personne exerçant une fonction de direction d'école exclus) "]
[]
["Ecoles bilingues, (+  a *  0.03 ) marquer avec x",null,null,null,null,null,null,null,null,null,"Diff.f.B-br.","Fall1","Fall2","Fall3","Fall4","Fall5","Fall6","Fall7","Fall8"]
[null,null,null,null,null,{"$f":"ROUND(0.062 *G17 + 0.106 * G22 + 0.194 * G24,3)","v":0}]
["Degré d'occupation total pour le pool de direction (dès 2.5% arrondi)",null,null,null,null,null,{"$f":"IF(SUM(G17,G19:G20,G22:G24)=0,\"\",IF((G27<>\"x\"),F28,F28 + G17 * 0.03))","v":""},{"$f":"IF(ISERROR(VLOOKUP(D3,Tabelle1!$B$10:$F$461,4,FALSE)),\"\",VLOOKUP(D3,Tabelle1!$B$10:$F$461,4,FALSE))","v":""},{"$f":"IF(L29<>\"\",L29,IF(M29<>\"\",M29,IF(N29<>\"\",N29,IF(O29<>\"\",O29,IF(P29<>\"\",P29,IF(Q29<>\"\",Q29,IF(R29<>\"\",R29,IF(S29<>\"\",S29,\"\"))))))))","v":""},null,{"$f":"IF(G29=\"\",0,ABS(H29-G29))","v":0},{"$f":"IF($G$29=\"\",\"\",IF(AND($G$29>=2.5,$H$29<=60,$H$29>=5,$K$29>3),ROUND($G$29/500,2)*500,\"\"))","v":""},{"$f":"IF($G$29=\"\",\"\",IF(AND($G$29>=2.5,$H$29<=60,$H$29>=5,$K$29<=3),$H$29,\"\"))","v":""},{"$f":"IF($G$29=\"\",\"\",IF(AND($G$29>=2.5,$H$29>60,$K$29>6),ROUND($G$29/500,2)*500,\"\"))","v":""},{"$f":"IF($G$29=\"\",\"\",IF(AND($G$29>=2.5,$H$29>60,$K$29<=6),$H$29,\"\"))","v":""},{"$f":"IF($G$29=\"\",\"\",IF(AND($G$29<2.5,$K$29>3),$G$29,\"\"))","v":""},{"$f":"IF($G$29=\"\",\"\",IF(AND($G$29<2.5,$H$29>=2.5,$K$29<=3),$H$29,\"\"))","v":""},{"$f":"IF($G$29=\"\",\"\",IF(AND($G$29<2.5,$H$29<2.5),$G$29,\"\"))","v":""},{"$f":"IF($G$29=\"\",\"\",IF(AND($G$29>=2.5,$H$29<=2.5),ROUND($G$29/500,2)*500,\"\"))","v":""}]
[]
["Gesamttotal Beschäftigungsgrad Schulleitungspool (ab 2.5% gerundet)",null,null,null,null,null,{"$f":"IFERROR(IF(G29<2.5,G29,ROUND(G29/500,2)*500),\"\")","v":""}]
[]
[]
["Pool destiné aux tâches spéciales (60% du pool de dir. arrondi, OSE, annexe 4, chiffre 3.3)"]
[]
["OSE, annexe 4, chiffre 3.2: Augmentation (autre langue d'enseign. ou échange de classes)"]
["Jusqu'à 9 classes impliquées (+3.5%), marquer avec x"]
["Dès 10 classes impliquées (+7%), marquer avec x",null,{"$f":"IF(AND(G37=\"x\",G38=\"x\"),\"Seulement marquer une croix!\",\"\")","v":""}]
[null,null,null,null,null,null,{"$f":"IF(ISTEXT(I29),\"\",I29*0.6)","v":""}]
[null,null,null,null,null,null,{"$f":"IF(G37=\"x\",(G39+3.5),IF(G38=\"x\",(G39+7),G39))","v":""}]
{"$rows_left_out":46}
{"sheet":"Tabelle1","index":4,"n_rows":461,"n_cols":6,"rows_kept":461,"cut":false,"hidden":true,"merged":[[6,4,6,5],[7,4,7,5]]}
["Beschäftigungsgrad des Schulleitungspools sowie des Leitungspools Spezialunterricht"]
["(Referenzdatum 1.08.2019)"]
["2019.ERZ.96 / 681538",null,null,null,null,"Eingabefrist : 1.9.2022"]
[]
[]
[null,"Schuljahr","2022/23",null,{"$f":"SUBTOTAL(9,E11:E461)","v":31052.476000000002},{"$f":"SUBTOTAL(9,F11:F461)","v":3060.3229999999976}]
[null,null,null,null,"Beschäftigungsgrad-% gerundet"]
[null,null,null,null,"Eingefrorene Werte "]
[null,{"$f":"SUBTOTAL(3,B11:B461)","v":451},null,null,"2021-08-01","2021-08-01"]
["Kr","SOE-Key","SOE-Name","Trägername","SL-Pool in %","Leitungspool Spezialunterricht in %"]
[1,20,"Schule Habkern","Einwohnergemeinde Habkern",20,1.1240000000000001]
[1,24,"Schule Gündlischwand/Lütschental","Einwohnergemeinde Gündlischwand",20,1.766]
[1,99,"Schule Matten","Einwohnergemeinde Matten bei Interlaken",100,10]
[1,107,"Schule Brienz","Einwohnergemeinde Brienz",105,15]
[1,110,"Schule Grindelwald","Einwohnergemeinde Grindelwald",85,5]
[1,135,"Schule Bönigen","Einwohnergemeinde Bönigen",60,5]
[1,137,"Schule Gsteigwiler","Einwohnergemeinde Gsteigwiler",10,0.40600000000000003]
[1,197,"Schule Interlaken","Einwohnergemeinde Interlaken",165,15]
[1,199,"Spezialunterricht Jungfrauregion","Einwohnergemeinde Interlaken",5,25]
[4,288,"Oberstufenschule Progymatte","Stadt Thun",100,5]
[4,289,"Oberstufenschule Buchholz","Stadt Thun",60,5]
[4,290,"Oberstufenschule Länggasse","Stadt Thun",75,5]
[4,291,"Oberstufenschule Strättligen","Stadt Thun",90,5]
[4,292,"Primarschulen Allmendingen Dürrenast Neufeld","Stadt Thun",200,20]
[4,293,"Primarschulen Lerchenfeld Goldiwil","Stadt Thun",90,10]
[4,294,"Primarschulen Pestalozzi Göttibach Seefeld","Stadt Thun",145,15]
[4,295,"Primarschulen Schönau Hohmad","Stadt Thun",150,15]
[4,296,"Primarschulen Gotthelf Obermatt Schoren","Stadt Thun",155,20]
[1,299,"Schule Leissigen","Einwohnergemeinde Leissigen",30,0.51200000000000001]
[1,320,"Schule Unterseen","Einwohnergemeinde Unterseen",150,10]
[1,324,"Schule bhs","Einwohnergemeinde Hofstetten bei Brienz",30,5]
[1,327,"Schule Ringgenberg","Einwohnergemeinde Ringgenberg (BE)",70,5]
[1,406,"Schule Wilderswil","Einwohnergemeinde Wilderswil",80,5]
[1,463,"Schule Därligen","Einwohnergemeinde Därligen",10,0.72299999999999998]
[1,488,"Schule Lauterbrunnental","Einwohnergemeinde Lauterbrunnen",50,5]
[1,528,"Schule Beatenberg","Einwohnergemeinde Beatenberg",30,1.996]
[2,8,"Schule Krattigen","Einwohnergemeinde Krattigen",20,0]
[2,11,"Schulen Oberwil","Einwohnergemeinde Oberwil im Simmental",25,0]
[2,64,"Kindergarten und Volksschule Lauenen","Einwohnergemeinde Lauenen",25,0]
[2,78,"Schule Reutigen-Zwieselberg","Einwohnergemeinde Reutigen",30,0]
{"$rows_left_out":422}
{"sheet":"Anleitung","index":5,"n_rows":6,"n_cols":1,"rows_kept":6,"cut":false,"hidden":true,"merged":[]}
["Anleitung"]
["Alle SOE-Aenderungen müssen in der Tabelle 1 erfasst werden."]
["Bei neuen SOE's sind die Pool-Wert = 0."]
[]
[]
["Regeln"]